{"text_format":"1","workbook":"xlsx","n_sheets":2,"sheets":["Interactive Report","Coding"],"not_rendered":{"charts":1,"images":0,"macros":0,"external_links":0,"defined_names":178,"comments":1,"pivot_tables":0},"unopened":[],"bounds":{"document_bytes":16777216,"sheet_cells":100000,"rows_first":2000,"rows_last":500,"rows_between":2000,"halvings":0,"cell_chars":16384,"cell_head_chars":4096},"cells_cut":0,"cells_raw":0,"read":"whole","date_system":"1900"}

{"sheet":"Interactive Report","index":0,"n_rows":120,"n_cols":13,"rows_kept":120,"cut":false,"hidden":false,"merged":[[23,3,23,4],[28,1,28,11]]}
[]
[null,"Fire & Rescue Service Example Interactive Report"]
[]
[null,null,null,null,null,null,null,null,null,null,null,{"$f":"IF(ISERROR(Coding!Z7),\"\",Coding!Z7)","v":""},{"$f":"IF(L4=\"\",\"\",OFFSET($C$35,MATCH(L4,OFFSET($D$35,0,0,Coding!$J$4,1),FALSE)-1,0,,))","v":""}]
[null,null,null,null,null,null,null,null,null,null,null,{"$f":"IF(ISERROR(Coding!Z8),\"\",Coding!Z8)","v":""},{"$f":"IF(L5=\"\",\"\",OFFSET($C$35,MATCH(L5,OFFSET($D$35,0,0,Coding!$J$4,1),FALSE)-1,0,,))","v":""}]
[null,null,null,null,null,null,null,null,null,null,null,{"$f":"IF(ISERROR(Coding!Z9),\"\",Coding!Z9)","v":""},{"$f":"IF(L6=\"\",\"\",OFFSET($C$35,MATCH(L6,OFFSET($D$35,0,0,Coding!$J$4,1),FALSE)-1,0,,))","v":""}]
[null,null,null,null,null,null,null,null,null,null,null,{"$f":"IF(ISERROR(Coding!Z10),\"\",Coding!Z10)","v":""},{"$f":"IF(L7=\"\",\"\",OFFSET($C$35,MATCH(L7,OFFSET($D$35,0,0,Coding!$J$4,1),FALSE)-1,0,,))","v":""}]
[null,null,null,null,null,null,null,null,null,null,null,{"$f":"IF(ISERROR(Coding!Z11),\"\",Coding!Z11)","v":""},{"$f":"IF(L8=\"\",\"\",OFFSET($C$35,MATCH(L8,OFFSET($D$35,0,0,Coding!$J$4,1),FALSE)-1,0,,))","v":""}]
[null,null,null,null,null,null,null,null,null,null,null,{"$f":"IF(ISERROR(Coding!Z12),\"\",Coding!Z12)","v":""},{"$f":"IF(L9=\"\",\"\",OFFSET($C$35,MATCH(L9,OFFSET($D$35,0,0,Coding!$J$4,1),FALSE)-1,0,,))","v":""}]
[null,null,null,null,null,null,null,null,null,null,null,{"$f":"IF(ISERROR(Coding!Z13),\"\",Coding!Z13)","v":""},{"$f":"IF(L10=\"\",\"\",OFFSET($C$35,MATCH(L10,OFFSET($D$35,0,0,Coding!$J$4,1),FALSE)-1,0,,))","v":""}]
{"$rows_left_out":111}
{"sheet":"Coding","index":1,"n_rows":1258,"n_cols":256,"rows_kept":1258,"cut":false,"hidden":true,"merged":[[3,27,3,28]]}
["ChartTinfo",-1,-1,"Page Number","--- Please Select ---",null,null,null,null,null,null,null,null,null,null,null,null,null,null,null,null,null,null,null,"Check against current chartforms & test - black bars tend to be on wrong side.",null,null,null,null,null,null,null,null,null,null,null,null,null,null,null,null,null,null,null,null,null,null,null,null,null,null,null,null,null,null,null,null,null,null,null,null,null,null,null,null,null,null,null,null,null,null,null,null,null,null,null,null,null,null,null,null,null,null,null,null,null,null,null,null,null,null,null,null,null,null,null,null,null,null,null,null,null,null,null,null,null,null,null,null,null,null,null,null,null,null,null,null,null,null,null,null,null,null,null,null,null,null,null,null,null,null,null,null,null,null,null,null,null,null,null,null,null,null,null,null,null,null,null,null,null,null,null,null,null,null,null,null,null,null,null,null,null,null,null,null,null,null,null,null,null,null,null,null,null,null,null,null,null,null,null,null,null,null,null,null,null,null,null,null,null,null,null,null,null,null,null,null,null,null,null,null,null,null,null,null,null,null,null,null,null,null,null,null,null,null,null,null,null,null,null,null,null,null,null,null,null,null,null,null,null,null,null,null,null,null,null,null,null,null,null,null,null,null,null,null,null,null,null,null,null,null,null,null,"--- Please Select ---","TABLE","CHARTS"]
["(P.01)[01]Cost Indicator 1",0,0,4,{"$f":"\"Page \"&D2&\": \" &RIGHT(A2,LEN(A2)-10)","v":"Page 4: Cost Indicator 1"},null,null,null,"Authority Counter:  ",{"$f":"G405","v":86},null,"DATA PROCESSING BLOCK FOR CHARTS",null,null,null,null,null,null,null,null,null,null,null,null,null,null,"Black Bar: ",{"$f":"IF(Coding!G74=1,\"\",INDEX(OFFSET($O$6,0,0,AuthorityCounter2+1,6),Coding!G74,6))","v":0},"Letter",null,"SORTER PROCESSING FOR TABLE UNDER DATABASE",null,null,null,null,null,null,null,null,null,null,null,null,null,null,null,null,null,null,null,null,null,null,null,null,null,null,null,null,null,null,null,null,null,null,null,null,null,null,null,null,null,null,null,null,null,null,null,null,null,null,null,null,null,null,null,null,null,null,null,null,null,null,null,null,null,null,null,null,null,null,null,null,null,null,null,null,null,null,null,null,null,null,null,null,null,null,null,null,null,null,null,null,null,null,null,null,null,null,null,null,null,null,null,null,null,null,null,null,null,null,null,null,null,null,null,null,null,null,null,null,null,null,null,null,null,null,null,null,null,null,null,null,null,null,null,null,null,null,null,null,null,null,null,null,null,null,null,null,null,null,null,null,null,null,null,null,null,null,null,null,null,null,null,null,null,null,null,null,null,null,null,null,null,null,null,null,null,null,null,null,null,null,null,null,null,null,null,null,null,null,null,null,null,null,null,null,null,null,null,null,null,null,null,null,null,null,null,null,null,null,null,null,null,null,null,null,null,null,null,null,null,null,null,"£#,##0;-£#,##0",{"$f":"AB7","v":0}]
["(P.01)[02]Cost Indicator 2",0,1,{"$f":"D2--OR(B3<>B2,LEFT(A3,5)<>LEFT(A2,5))","v":4},{"$f":"\"Page \"&D3&\": \" &RIGHT(A3,LEN(A3)-10)","v":"Page 4: Cost Indicator 2"},null,null,null,"Charts counter:  ",{"$f":"G404","v":5},null,null,null,null,null,null,null,null,null,null,null,null,null,null,null,null,"Average: ",{"$f":"AVERAGE(OFFSET(Y7,0,0,Coding!J6,1))","v":0},{"$f":"INDEX(V6:V192,Coding!G74)","v":""},null,null,null,null,null,null,null,null,null,null,null,null,null,null,null,null,null,null,null,null,null,null,null,null,null,null,null,null,null,null,null,null,null,null,null,null,null,null,null,null,null,null,null,null,null,null,null,null,null,null,null,null,null,null,null,null,null,null,null,null,null,null,null,null,null,null,null,null,null,null,null,null,null,null,null,null,null,null,null,null,null,null,null,null,null,null,null,null,null,null,null,null,null,null,null,null,null,null,null,null,null,null,null,null,null,null,null,null,null,null,null,null,null,null,null,null,null,null,null,null,null,null,null,null,null,null,null,null,null,null,null,null,null,null,null,null,null,null,null,null,null,null,null,null,null,null,null,null,null,null,null,null,null,null,null,null,null,null,null,null,null,null,null,null,null,null,null,null,null,null,null,null,null,null,null,null,null,null,null,null,null,null,null,null,null,null,null,null,null,null,null,null,null,null,null,null,null,null,null,null,null,null,null,null,null,null,null,null,null,null,null,null,null,null,null,null,null,null,null,null,null,null,null,null,null,"£#,##0",{"$f":"AB7","v":0}]
["(P.01)[03]Workload Indicator 1",0,2,{"$f":"D3--OR(B4<>B3,LEFT(A4,5)<>LEFT(A3,5))","v":4},{"$f":"\"Page \"&D4&\": \" &RIGHT(A4,LEN(A4)-10)","v":"Page 4: Workload Indicator 1"},null,null,null,"Authorities in Group:  ",{"$f":"IF($H$75=\"OC\",COUNTIF(OFFSET($R$7,0,0,AuthorityCounter2,1),1),COUNTIF(OFFSET($P$7,0,0,AuthorityCounter2,1),1))","v":86},null,"Authority Details:",null,null,"Data Selection:",null,null,null,null,null,null,"Letters:",null,null,"Chart Data:",null,"Title: ",{"$f":"IF($G$38=1,\"Please use drop down list below to select graph\",RIGHT(OFFSET(A1,G38-1,0),LEN(OFFSET(A1,G38-1,0))-10))","v":"Please use drop down list below to select graph"},null,null,"1 = Auth, 2 = Tier, 3 = Data",null,null,null,null,null,null,null,null,null,null,null,null,null,null,null,null,null,null,null,null,null,null,null,null,null,null,null,null,null,null,null,null,null,null,null,null,null,null,null,null,null,null,null,null,null,null,null,null,null,null,null,null,null,null,null,null,null,null,null,null,null,null,null,null,null,null,null,null,null,null,null,null,null,null,null,null,null,null,null,null,null,null,null,null,null,null,null,null,null,null,null,null,null,null,null,null,null,null,null,null,null,null,null,null,null,null,null,null,null,null,null,null,null,null,null,null,null,null,null,null,null,null,null,null,null,null,null,null,null,null,null,null,null,null,null,null,null,null,null,null,null,null,null,null,null,null,null,null,null,null,null,null,null,null,null,null,null,null,null,null,null,null,null,null,null,null,null,null,null,null,null,null,null,null,null,null,null,null,null,null,null,null,null,null,null,null,null,null,null,null,null,null,null,null,null,null,null,null,null,null,null,null,null,null,null,null,null,null,null,null,null,null,null,null,null,null,null,null,null,null,null,null,null,"0.0_ ;-0.0 ",{"$f":"AB7","v":0}]
["(P.02)[01]Performance Measure 1",0,3,{"$f":"D4--OR(B5<>B4,LEFT(A5,5)<>LEFT(A4,5))","v":5},{"$f":"\"Page \"&D5&\": \" &RIGHT(A5,LEN(A5)-10)","v":"Page 5: Performance Measure 1"},null,null,null,null,null,null,null,null,null,null,null,null,null,null,null,null,null,null,null,null,null,null,null,null,null,null,null,null,null,null,null,null,null,null,null,null,true,{"$f":"300-COUNTIF(AQ7:AQ306,\"\")-COUNTIF(AQ7:AQ306,\"0\")","v":86},null,null,null,"UPDATE THESE IF DIFFERENT:",null,null,null,null,null,null,null,null,null,null,null,null,null,null,null,null,null,null,null,null,null,null,null,null,null,null,null,null,null,null,null,null,null,null,null,null,null,null,null,null,null,null,null,null,null,null,null,null,null,null,null,null,null,null,null,null,null,null,null,null,null,null,null,null,null,null,null,null,null,null,null,null,null,null,null,null,null,null,null,null,null,null,null,null,null,null,null,null,null,null,null,null,null,null,null,null,null,null,null,null,null,null,null,null,null,null,null,null,null,null,null,null,null,null,null,null,null,null,null,null,null,null,null,null,null,null,null,null,null,null,null,null,null,null,null,null,null,null,null,null,null,null,null,null,null,null,null,null,null,null,null,null,null,null,null,null,null,null,null,null,null,null,null,null,null,null,null,null,null,null,null,null,null,null,null,null,null,null,null,null,null,null,null,null,null,null,null,null,null,null,null,null,null,null,null,null,null,null,null,null,null,null,null,null,null,null,null,"#,##0_ ;-#,##0 ",{"$f":"AB7","v":0}]
["(P.02)[02]Staff Cost (inc overheads) comparison",0,4,{"$f":"D5--OR(B6<>B5,LEFT(A6,5)<>LEFT(A5,5))","v":5},{"$f":"\"Page \"&D6&\": \" &RIGHT(A6,LEN(A6)-10)","v":"Page 5: Staff Cost (inc overheads) comparison"},null,null,null,"Authorities on Graph:  ",{"$f":"SUMIF(OFFSET(Coding!$S$7,0,0,AuthorityCounter2,1),\"<>0\",OFFSET($S$7,0,0,AuthorityCounter2,1))","v":86},null,"--- Please Select ---","Tier",null,"Initial Data","Group","Manual","OC","Criteria","Chart Data",null,"Letters",null,null,"Ordered","Letter","Average","Black","Bars",null,1,null,null,null,"U(prev col)",null,null,null,0,"Group Selected",null,null,"Auth for table","U(prev col)",null,null,"Year:",2012,null,null,null,null,null,null,null,null,null,null,null,null,null,null,null,null,null,null,null,null,null,null,null,null,null,null,null,null,null,null,null,null,null,null,null,null,null,null,null,null,null,null,null,null,null,null,null,null,null,null,null,null,null,null,null,null,null,null,null,null,null,null,null,null,null,null,null,null,null,null,null,null,null,null,null,null,null,null,null,null,null,null,null,null,null,null,null,null,null,null,null,null,null,null,null,null,null,null,null,null,null,null,null,null,null,null,null,null,null,null,null,null,null,null,null,null,null,null,null,null,null,null,null,null,null,null,null,null,null,null,null,null,null,null,null,null,null,null,null,null,null,null,null,null,null,null,null,null,null,null,null,null,null,null,null,null,null,null,null,null,null,null,null,null,null,null,null,null,null,null,null,null,null,null,null,null,null,null,null,null,null,null,null,null,null,null,null,null,null,null,null,null,null,null,null,null,null,null,null,null,null,null,null,null,null,null,"£#,##0",{"$f":"AB7","v":0}]
[null,null,null,null,null,null,null,null,"Show only selected Authorities tickbox:  ",true,null,"Autumnham",1,null,{"$f":"IF(ISNUMBER(--OFFSET($D$409,(ROW()-6)+$G$39+AuthorityCounter+5,$G$40)),OFFSET($D$409,(ROW()-6)+$G$39+AuthorityCounter+5,$G$40),\"na\")","v":0},{"$f":"IF((ROW()-5=$G$36),1,IF((M7=Coding!$H$75)+(Coding!$H$75=\"ALL\")+(Coding!$H$75=\"U\")*OR(M7=\"wu\",M7=\"su\",M7=\"ul\",M7=\"um\",M7=\"uu\")+(Coding!$H$75=\"na\")*AND(M7<>\"wu\",M7<>\"su\",M7<>\"ul\",M7<>\"um\",M7<>\"uu\",M7<>\"c\",M7<>\"d\",M7<>\"p\"),1,0))","v":1},false,{"$f":"IF(OR(NOT(ISERROR(MATCH(L7,OFFSET($H$410,$G$36-2,0,1,18),FALSE))),$G$75=L7),1,0+(($G$36=1)*($H$75=\"OC\")))","v":0},{"$f":"IF((ROW()-5=$G$36),1,IF($H$75=\"OC\",IF(NOT($J$10)+Q7,R7,0),IF(NOT($J$10)+Q7,P7,0)))","v":1},{"$f":"IF(S7=1,O7,\"not selected\")","v":0},null,{"$f":"IF((S7=1)*($J$6<22),INDEX($J$13:$J$33,SUM($S$7:S7),1),\"\")","v":""},{"$f":"COUNTIF($T$7:T7,T7)","v":1},null,{"$f":"IF((ROW()-6-$J$8)<1,\"na\",LARGE(OFFSET($T$7,0,0,AuthorityCounter2,1),ROW()-6-$J$8))","v":0},{"$f":"INDEX(V:V,SUMPRODUCT((OFFSET($T$7,0,0,AuthorityCounter2,1)=Y7)*1,(OFFSET($W$7,0,0,AuthorityCounter2,1)=COUNTIF($Y$7:Y7,Y7))*1,ROW(OFFSET($W$7,0,0,AuthorityCounter2,1))))","v":""},{"$f":"AB$3","v":0},{"$f":"IF((Y7=AB$2)*(Z7=AC$3)*(SUM($AB$6:AB6)=0),+Y7,0)","v":0},{"$f":"IF(ISNUMBER(AA7),Y7-AB7,\"na\")","v":0},null,{"$f":"IF($AE$6=3,O7,SUM((CODE(MID(CONCATENATE(UPPER(M7),\"aaaaaaaaaa\"),{1;2},1))-30)*{1;0.01}))","v":19.670000000000002},{"$f":"COUNTIF($AE$7:$AE7,AE7)","v":1},null,{"$f":"IF($AE$6=3,LARGE(OFFSET($AE$7,0,0,AuthorityCounter2,1),ROW()-6),SMALL(OFFSET($AE$7,0,0,AuthorityCounter2,1),ROW()-6))","v":19.670000000000002},{"$f":"IF(ISERROR(AH7),\"na\",AH7)","v":19.670000000000002},{"$f":"COUNTIF($AI$7:$AI7,AI7)","v":1},{"$f":"IF($AE$6=1,L7,OFFSET($L$1,SUMPRODUCT(--(OFFSET($AE$7,0,0,AuthorityCounter,1)=AI7),--(OFFSET($AF$7,0,0,AuthorityCounter,1)=COUNTIF($AI$7:AI7,AI7)),ROW(OFFSET($AF$7,0,0,AuthorityCounter,1)))-1,0))","v":"Autumnham"},null,{"$f":"IF(VLOOKUP(AK7,$L$7:$S$306,IF($H$75=\"OC\",8,5),FALSE)=1,MAX(AM6:$AM$6)+1,0)","v":1},{"$f":"OFFSET($AK$1,ABS(SUMPRODUCT(--($AM$7:$AM$306=(ROW()-6)),ROW($AM$7:$AM$306))-1),0)","v":"Autumnham"},{"$f":"IF(AN7=0,0,VLOOKUP(AN7,$L$7:$Q$306,6,FALSE))","v":false},{"$f":"IF($AP$5,SUM(SUMPRODUCT(--AO$7:$AO7)*AO7,(SUMPRODUCT(--(AO$7:$AO7=FALSE))+SUMPRODUCT(--$AO$7:$AO$306))*(1-AO7)),ROW()-6)","v":1},{"$f":"OFFSET($AN$6,MATCH(ROW()-6,$AP$7:$AP$306,FALSE),0)","v":"Autumnham"},{"$f":"IF(ISERROR(AQ7),\"na\",AQ7)","v":"Autumnham"},null,null,"E-mail:","chris.greene@cipfa.org",null,null,null,null,null,null,null,null,null,null,null,null,null,null,null,null,null,null,null,null,null,null,null,null,null,null,null,null,null,null,null,null,null,null,null,null,null,null,null,null,null,null,null,null,null,null,null,null,null,null,null,null,null,null,null,null,null,null,null,null,null,null,null,null,null,null,null,null,null,null,null,null,null,null,null,null,null,null,null,null,null,null,null,null,null,null,null,null,null,null,null,null,null,null,null,null,null,null,null,null,null,null,null,null,null,null,null,null,null,null,null,null,null,null,null,null,null,null,null,null,null,null,null,null,null,null,null,null,null,null,null,null,null,null,null,null,null,null,null,null,null,null,null,null,null,null,null,null,null,null,null,null,null,null,null,null,null,null,null,null,null,null,null,null,null,null,null,null,null,null,null,null,null,null,null,null,null,null,null,null,null,null,null,null,null,null,null,null,null,null,null,null,null,null,null,null,null,null,null,null,null,null,null,null,null,null,"0%",{"$f":"AB7","v":0}]
[null,null,null,null,null,null,null,null,"\"na\"s at start of Graph:  ",{"$f":"SUMPRODUCT(ISTEXT(OFFSET(T7,0,0,AuthorityCounter2,1))*1)-SUMPRODUCT((OFFSET(T7,0,0,AuthorityCounter2,1)=\"not selected\")*1)","v":0},null,"Bearcaster",2,null,0,{"$f":"IF((ROW()-5=$G$36),1,IF((M8=Coding!$H$75)+(Coding!$H$75=\"ALL\")+(Coding!$H$75=\"U\")*OR(M8=\"wu\",M8=\"su\",M8=\"ul\",M8=\"um\",M8=\"uu\")+(Coding!$H$75=\"na\")*AND(M8<>\"wu\",M8<>\"su\",M8<>\"ul\",M8<>\"um\",M8<>\"uu\",M8<>\"c\",M8<>\"d\",M8<>\"p\"),1,0))","v":1},false,0,1,0,null,{"$f":"IF((S8=1)*($J$6<22),INDEX($J$13:$J$33,SUM($S$7:S8),1),\"\")","v":""},{"$f":"COUNTIF($T$7:T8,T8)","v":2},null,{"$f":"IF((ROW()-6-$J$8)<1,\"na\",LARGE(OFFSET($T$7,0,0,AuthorityCounter2,1),ROW()-6-$J$8))","v":0},{"$f":"INDEX(V:V,SUMPRODUCT((OFFSET($T$7,0,0,AuthorityCounter2,1)=Y8)*1,(OFFSET($W$7,0,0,AuthorityCounter2,1)=COUNTIF($Y$7:Y8,Y8))*1,ROW(OFFSET($W$7,0,0,AuthorityCounter2,1))))","v":""},0,{"$f":"IF((Y8=AB$2)*(Z8=AC$3)*(SUM($AB$6:AB7)=0),+Y8,0)","v":0},{"$f":"IF(ISNUMBER(AA8),Y8-AB8,\"na\")","v":0},null,{"$f":"IF($AE$6=3,O8,SUM((CODE(MID(CONCATENATE(UPPER(M8),\"aaaaaaaaaa\"),{1;2},1))-30)*{1;0.01}))","v":20.67},{"$f":"COUNTIF($AE$7:$AE8,AE8)","v":1},null,19.670000000000002,19.670000000000002,{"$f":"COUNTIF($AI$7:$AI8,AI8)","v":2},{"$f":"IF($AE$6=1,L8,OFFSET($L$1,SUMPRODUCT(--(OFFSET($AE$7,0,0,AuthorityCounter,1)=AI8),--(OFFSET($AF$7,0,0,AuthorityCounter,1)=COUNTIF($AI$7:AI8,AI8)),ROW(OFFSET($AF$7,0,0,AuthorityCounter,1)))-1,0))","v":"Bearcaster"},null,{"$f":"IF(VLOOKUP(AK8,$L$7:$S$306,IF($H$75=\"OC\",8,5),FALSE)=1,MAX(AM$6:$AM7)+1,0)","v":2},{"$f":"OFFSET($AK$1,ABS(SUMPRODUCT(--($AM$7:$AM$306=(ROW()-6)),ROW($AM$7:$AM$306))-1),0)","v":"Bearcaster"},{"$f":"IF(AN8=0,0,VLOOKUP(AN8,$L$7:$Q$306,6,FALSE))","v":false},{"$f":"IF($AP$5,SUM(SUMPRODUCT(--AO$7:$AO8)*AO8,(SUMPRODUCT(--(AO$7:$AO8=FALSE))+SUMPRODUCT(--$AO$7:$AO$306))*(1-AO8)),ROW()-6)","v":2},{"$f":"OFFSET($AN$6,MATCH(ROW()-6,$AP$7:$AP$306,FALSE),0)","v":"Bearcaster"},"Bearcaster",null,null,null,null,null,null,null,null,null,null,null,null,null,null,null,null,null,null,null,null,null,null,null,null,null,null,null,null,null,null,null,null,null,null,null,null,null,null,null,null,null,null,null,null,null,null,null,null,null,null,null,null,null,null,null,null,null,null,null,null,null,null,null,null,null,null,null,null,null,null,null,null,null,null,null,null,null,null,null,null,null,null,null,null,null,null,null,null,null,null,null,null,null,null,null,null,null,null,null,null,null,null,null,null,null,null,null,null,null,null,null,null,null,null,null,null,null,null,null,null,null,null,null,null,null,null,null,null,null,null,null,null,null,null,null,null,null,null,null,null,null,null,null,null,null,null,null,null,null,null,null,null,null,null,null,null,null,null,null,null,null,null,null,null,null,null,null,null,null,null,null,null,null,null,null,null,null,null,null,null,null,null,null,null,null,null,null,null,null,null,null,null,null,null,null,null,null,null,null,null,null,null,null,null,null,null,null,null,null,null,"£#,##0;-£#,##0",{"$f":"AB7","v":0}]
[null,null,null,null,null,null,null,null,"Number of Authorities Selected:  ",{"$f":"SUMPRODUCT((Q7:Q306=TRUE)*1,(P7:P306=1)*1)","v":0},null,"Bunbridge",2,null,0,{"$f":"IF((ROW()-5=$G$36),1,IF((M9=Coding!$H$75)+(Coding!$H$75=\"ALL\")+(Coding!$H$75=\"U\")*OR(M9=\"wu\",M9=\"su\",M9=\"ul\",M9=\"um\",M9=\"uu\")+(Coding!$H$75=\"na\")*AND(M9<>\"wu\",M9<>\"su\",M9<>\"ul\",M9<>\"um\",M9<>\"uu\",M9<>\"c\",M9<>\"d\",M9<>\"p\"),1,0))","v":1},false,0,1,0,null,{"$f":"IF((S9=1)*($J$6<22),INDEX($J$13:$J$33,SUM($S$7:S9),1),\"\")","v":""},{"$f":"COUNTIF($T$7:T9,T9)","v":3},null,{"$f":"IF((ROW()-6-$J$8)<1,\"na\",LARGE(OFFSET($T$7,0,0,AuthorityCounter2,1),ROW()-6-$J$8))","v":0},{"$f":"INDEX(V:V,SUMPRODUCT((OFFSET($T$7,0,0,AuthorityCounter2,1)=Y9)*1,(OFFSET($W$7,0,0,AuthorityCounter2,1)=COUNTIF($Y$7:Y9,Y9))*1,ROW(OFFSET($W$7,0,0,AuthorityCounter2,1))))","v":""},0,{"$f":"IF((Y9=AB$2)*(Z9=AC$3)*(SUM($AB$6:AB8)=0),+Y9,0)","v":0},0,null,{"$f":"IF($AE$6=3,O9,SUM((CODE(MID(CONCATENATE(UPPER(M9),\"aaaaaaaaaa\"),{1;2},1))-30)*{1;0.01}))","v":20.67},{"$f":"COUNTIF($AE$7:$AE9,AE9)","v":2},null,19.670000000000002,19.670000000000002,{"$f":"COUNTIF($AI$7:$AI9,AI9)","v":3},{"$f":"IF($AE$6=1,L9,OFFSET($L$1,SUMPRODUCT(--(OFFSET($AE$7,0,0,AuthorityCounter,1)=AI9),--(OFFSET($AF$7,0,0,AuthorityCounter,1)=COUNTIF($AI$7:AI9,AI9)),ROW(OFFSET($AF$7,0,0,AuthorityCounter,1)))-1,0))","v":"Bunbridge"},null,{"$f":"IF(VLOOKUP(AK9,$L$7:$S$306,IF($H$75=\"OC\",8,5),FALSE)=1,MAX(AM$6:$AM8)+1,0)","v":3},"Bunbridge",false,{"$f":"IF($AP$5,SUM(SUMPRODUCT(--AO$7:$AO9)*AO9,(SUMPRODUCT(--(AO$7:$AO9=FALSE))+SUMPRODUCT(--$AO$7:$AO$306))*(1-AO9)),ROW()-6)","v":3},"Bunbridge","Bunbridge",null,null,null,null,null,null,null,null,null,null,null,null,null,null,null,null,null,null,null,null,null,null,null,null,null,null,null,null,null,null,null,null,null,null,null,null,null,null,null,null,null,null,null,null,null,null,null,null,null,null,null,null,null,null,null,null,null,null,null,null,null,null,null,null,null,null,null,null,null,null,null,null,null,null,null,null,null,null,null,null,null,null,null,null,null,null,null,null,null,null,null,null,null,null,null,null,null,null,null,null,null,null,null,null,null,null,null,null,null,null,null,null,null,null,null,null,null,null,null,null,null,null,null,null,null,null,null,null,null,null,null,null,null,null,null,null,null,null,null,null,null,null,null,null,null,null,null,null,null,null,null,null,null,null,null,null,null,null,null,null,null,null,null,null,null,null,null,null,null,null,null,null,null,null,null,null,null,null,null,null,null,null,null,null,null,null,null,null,null,null,null,null,null,null,null,null,null,null,null,null,null,null,null,null,null,null,null,null,null,null,"£#,##0",{"$f":"AB7","v":0}]
[null,null,null,null,null,null,null,null,"Show only selected Authorities Actual?:  ",{"$f":"IF(J9=0,FALSE,J7)","v":false},null,"Castfield",1,null,0,{"$f":"IF((ROW()-5=$G$36),1,IF((M10=Coding!$H$75)+(Coding!$H$75=\"ALL\")+(Coding!$H$75=\"U\")*OR(M10=\"wu\",M10=\"su\",M10=\"ul\",M10=\"um\",M10=\"uu\")+(Coding!$H$75=\"na\")*AND(M10<>\"wu\",M10<>\"su\",M10<>\"ul\",M10<>\"um\",M10<>\"uu\",M10<>\"c\",M10<>\"d\",M10<>\"p\"),1,0))","v":1},false,1,1,0,null,{"$f":"IF((S10=1)*($J$6<22),INDEX($J$13:$J$33,SUM($S$7:S10),1),\"\")","v":""},{"$f":"COUNTIF($T$7:T10,T10)","v":4},null,0,{"$f":"INDEX(V:V,SUMPRODUCT((OFFSET($T$7,0,0,AuthorityCounter2,1)=Y10)*1,(OFFSET($W$7,0,0,AuthorityCounter2,1)=COUNTIF($Y$7:Y10,Y10))*1,ROW(OFFSET($W$7,0,0,AuthorityCounter2,1))))","v":""},0,{"$f":"IF((Y10=AB$2)*(Z10=AC$3)*(SUM($AB$6:AB9)=0),+Y10,0)","v":0},0,null,{"$f":"IF($AE$6=3,O10,SUM((CODE(MID(CONCATENATE(UPPER(M10),\"aaaaaaaaaa\"),{1;2},1))-30)*{1;0.01}))","v":19.670000000000002},{"$f":"COUNTIF($AE$7:$AE10,AE10)","v":2},null,19.670000000000002,19.670000000000002,{"$f":"COUNTIF($AI$7:$AI10,AI10)","v":4},{"$f":"IF($AE$6=1,L10,OFFSET($L$1,SUMPRODUCT(--(OFFSET($AE$7,0,0,AuthorityCounter,1)=AI10),--(OFFSET($AF$7,0,0,AuthorityCounter,1)=COUNTIF($AI$7:AI10,AI10)),ROW(OFFSET($AF$7,0,0,AuthorityCounter,1)))-1,0))","v":"Castfield"},null,{"$f":"IF(VLOOKUP(AK10,$L$7:$S$306,IF($H$75=\"OC\",8,5),FALSE)=1,MAX(AM$6:$AM9)+1,0)","v":4},"Castfield",false,{"$f":"IF($AP$5,SUM(SUMPRODUCT(--AO$7:$AO10)*AO10,(SUMPRODUCT(--(AO$7:$AO10=FALSE))+SUMPRODUCT(--$AO$7:$AO$306))*(1-AO10)),ROW()-6)","v":4},"Castfield","Castfield",null,null,null,null,null,null,null,null,null,null,null,null,null,null,null,null,null,null,null,null,null,null,null,null,null,null,null,null,null,null,null,null,null,null,null,null,null,null,null,null,null,null,null,null,null,null,null,null,null,null,null,null,null,null,null,null,null,null,null,null,null,null,null,null,null,null,null,null,null,null,null,null,null,null,null,null,null,null,null,null,null,null,null,null,null,null,null,null,null,null,null,null,null,null,null,null,null,null,null,null,null,null,null,null,null,null,null,null,null,null,null,null,null,null,null,null,null,null,null,null,null,null,null,null,null,null,null,null,null,null,null,null,null,null,null,null,null,null,null,null,null,null,null,null,null,null,null,null,null,null,null,null,null,null,null,null,null,null,null,null,null,null,null,null,null,null,null,null,null,null,null,null,null,null,null,null,null,null,null,null,null,null,null,null,null,null,null,null,null,null,null,null,null,null,null,null,null,null,null,null,null,null,null,null,null,null,null,null,null,null,"0_ ;-0 ",{"$f":"AB7","v":0}]
{"$rows_left_out":1248}